#,Annotated Sequence,Modifications,Contaminant,Qvality PEP,Qvality q-value,# Protein Groups,# Proteins,# PSMs,Master Protein Accessions,Positions in Master Proteins,Master Protein Descriptions,Protein Accessions,# Missed Cleavages,Theo. MH+ [Da],Abundances (Normalized) Ratio: (Disease) / (Control),Abundances (Normalized) Ratio (log2): (Disease) / (Control),Abundances (Normalized) Ratio P-Value: (Disease) / (Control),Abundances (Normalized) Ratio Adj. P-Value: (Disease) / (Control),Abundances (Normalized) Fold Change: (Disease) / (Control),Confidence,Abundances (Normalized) (Grouped): Control,Abundances (Normalized) (Grouped): Disease,Abundances (Normalized) (Grouped) CV [%]: Control,Abundances (Normalized) (Grouped) CV [%]: Disease,Abundances (Grouped) Count: Control,Abundances (Grouped) Count: Disease,"Abundances (Normalized): F1: Sample, Control","Abundances (Normalized): F2: Sample, Control","Abundances (Normalized): F3: Sample, Control","Abundances (Normalized): F4: Sample, Control","Abundances (Normalized): F5: Sample, Control","Abundances (Normalized): F6: Sample, Control","Abundances (Normalized): F7: Sample, Control","Abundances (Normalized): F8: Sample, Disease","Abundances (Normalized): F9: Sample, Disease","Abundances (Normalized): F10: Sample, Disease","Abundances (Normalized): F11: Sample, Disease","Abundances (Normalized): F12: Sample, Disease","Abundances (Normalized): F13: Sample, Disease","Abundance: F1: Sample, Control","Abundance: F2: Sample, Control","Abundance: F3: Sample, Control","Abundance: F4: Sample, Control","Abundance: F5: Sample, Control","Abundance: F6: Sample, Control","Abundance: F7: Sample, Control","Abundance: F8: Sample, Disease","Abundance: F9: Sample, Disease","Abundance: F10: Sample, Disease","Abundance: F11: Sample, Disease","Abundance: F12: Sample, Disease","Abundance: F13: Sample, Disease","Abundances Count: F1: Sample, Control","Abundances Count: F2: Sample, Control","Abundances Count: F3: Sample, Control","Abundances Count: F4: Sample, Control","Abundances Count: F5: Sample, Control","Abundances Count: F6: Sample, Control","Abundances Count: F7: Sample, Control","Abundances Count: F8: Sample, Disease","Abundances Count: F9: Sample, Disease","Abundances Count: F10: Sample, Disease","Abundances Count: F11: Sample, Disease","Abundances Count: F12: Sample, Disease","Abundances Count: F13: Sample, Disease",Quan Info,Charge,DeltaScore,DeltaCn,Rank,DeltaM [ppm],Percolator q-Value,Percolator PEP,Xcorr,Top Apex RT [min],Abundance Ratio: (Disease) / (Control),Abundance Ratio (log2): (Disease) / (Control),Abundance Ratio P-Value: (Disease) / (Control),Abundance Ratio Adj. P-Value: (Disease) / (Control),Abundances Fold Change: (Disease) / (Control),Confidence.1,Abundances (Grouped): Control,Abundances (Grouped): Disease,Abundances (Grouped) CV [%]: Control,Abundances (Grouped) CV [%]: Disease
68,[T].SIQDWVQKTIAEN.[-],,False,0.0110866,0.0013942,1,7,2,J3QR68,J3QR68 [392-404],Haptoglobin (Fragment) OS=Homo sapiens OX=9606 GN=HP PE=1 SV=1,J3QR68; P00738; P00738-2; H0Y300; A0A0C4DGL8; J3QLC9; A0A087WU08,0,1531.7751,100.0,6.64,,,100.0,Low,,2016005.66290251,,65.89,,6.0,,,,,,,,3092622.04948759,4603431.70854923,2262472.13444357,564077.272213252,1796388.4597653,1038994.49332489,,,,,,,,383638.1875,212885.59375,218403.0,198304.421875,117027.7890625,83219.296875,,,,,,,,1.0,1.0,1.0,1.0,1.0,1.0,,2,0.5077,0,1,-0.42,0.0004186,0.001611,1.95,88.0,100.0,6.64,,,100.0,Low,,205465.701746325,,51.73
246,[D].PDAPLQPVTPLQLFEGRRN.[R],,False,0.00885571,0.0013942,1,11,1,F5GXS0,F5GXS0 [1431-1449],C4a anaphylatoxin OS=Homo sapiens OX=9606 GN=C4B PE=1 SV=1,F5GXS0; A0A0G2JL54; A0A140TA32; A0A3B3ISA6; P0C0L4-2; A0A0G2JPR0; P0C0L4; A0A140TA29; P0C0L5; A0A140TA44; A0A140TA49,0,2148.15601,100.0,6.64,,,100.0,Low,,1920307.21779391,,61.79,,6.0,,,,,,,,1402685.63560838,4003168.2066304,4910154.90040479,1449356.56932446,2544287.50575173,1038959.96444453,,,,,,,,174002.4375,185126.421875,473991.5,509529.15625,165750.53125,83216.53125,,,,,,,,1.0,1.0,1.0,1.0,1.0,1.0,,3,0.4413,0,1,-1.81,0.0004186,0.00119,2.47,98.15,100.0,6.64,,,100.0,Low,,179478.267909804,,67.65
370,[K].TVIGPDGHKEVT.[K],,False,0.00347662,0.0013942,1,2,1,P02671,P02671 [468-479],Fibrinogen alpha chain OS=Homo sapiens OX=9606 GN=FGA PE=1 SV=2,P02671; P02671-2,0,1252.65319,100.0,6.64,,,100.0,Low,,1259317.71917946,,99.31,,5.0,,,,,,,,6819819.96545348,,935697.651761065,3750844.96813569,538678.599361512,1259317.71917946,,,,,,,,845995.1875,,90325.609375,1318629.875,35092.8359375,100866.3046875,,,,,,,,1.0,,1.0,1.0,1.0,1.0,,3,0.2697,0,1,-0.63,0.0004186,0.0003408,1.78,38.11,100.0,6.64,,,100.0,Low,,100866.3046875,,120.62
746,[V].SETESRGSESGIFTN.[T],,False,0.0617707,0.00160737,1,2,1,P02671,P02671 [542-556],Fibrinogen alpha chain OS=Homo sapiens OX=9606 GN=FGA PE=1 SV=2,P02671; P02671-2,0,1600.70853,100.0,6.64,,,100.0,Low,,1023026.52339401,,51.38,,5.0,,,,,,,,1830926.64002098,1152607.35699752,1023026.52339401,587811.705804952,,524845.175241329,,,,,,,,227125.515625,53302.30078125,98755.71875,206648.390625,,42037.99609375,,,,,,,,1.0,1.0,1.0,1.0,,1.0,,2,0.4976,0,1,0.84,0.0009223,0.01631,2.09,48.1,100.0,6.64,,,100.0,Low,,98755.71875,,68.74
1220,[G].NYDAAKRGP.[G],,False,0.101615,0.00547755,2,8,1,P0DJI9; P0DJI8,P0DJI9 [59-67]; P0DJI8 [59-67],"Serum amyloid A-2 proteincur OS=Homo sapiens OX=9606 GN=SAA2 PE=1 SV=1
Serum amyloid A-1 protein OS=Homo sapiens OX=9606 GN=SAA1 PE=1 SV=1",E9PR14; P0DJI9; E9PQD6; P0DJI8; A0A096LPE2; P0DJI9-2; A0A3B3ISW8; G3V1D9,0,991.49557,100.0,6.64,,,100.0,Low,,344006.699086395,,156.7,,5.0,,,,,,,,288161.358648036,865518.069801106,344006.699086395,5573669.94839074,,286626.576825506,,,,,,,,35746.26953125,40025.86328125,33207.96484375,1959453.875,,22957.640625,,,,,,,,1.0,1.0,1.0,1.0,,1.0,Shared,2,0.4336,0,1,-0.1,0.002328,0.03251,1.13,29.15,100.0,6.64,,,100.0,Low,,35746.26953125,,205.98
143,[L].GIEEAFTSKADLSGITG.[A],,False,0.000607937,0.0013942,1,2,4,G3V3A0,G3V3A0 [114-130],Alpha-1-antichymotrypsin OS=Homo sapiens OX=9606 GN=SERPINA3 PE=1 SV=1,G3V3A0; P01011,0,1695.84357,100.0,6.64,,,100.0,Low,,1905949.61494882,,106.25,,4.0,,,,,,,,1687944.51733595,,1491476.74720745,9792168.06887998,,2152110.98316008,,,,,,,,209388.65625,,143976.578125,3442489.75,,172375.46875,,,,,,,,1.0,,1.0,1.0,,1.0,,2,0.4232,0,1,-0.44,0.0004186,3.318e-05,2.67,82.08,100.0,6.64,,,100.0,Low,,189982.809148687,,164.69
352,[S].TSYNRGDSTFESKSY.[K],,False,0.0144712,0.0013942,1,2,1,P02671,P02671 [587-601],Fibrinogen alpha chain OS=Homo sapiens OX=9606 GN=FGA PE=1 SV=2,P02671; P02671-2,0,1741.76638,100.0,6.64,,,100.0,Low,,770062.957112257,,58.59,,4.0,,,,,,,,1498037.44854585,,675583.33406034,877755.456684355,,320253.829114436,,,,,,,,185830.78125,,65216.01953125,308579.6875,,25651.048828125,,,,,,,,1.0,,1.0,1.0,,1.0,,3,0.3478,0,1,0.95,0.0004186,0.002298,1.38,42.96,100.0,6.64,,,100.0,Low,,110086.983151994,,87.37
372,[E].TTYTVLQNEDTKSG.[-],,False,0.00487227,0.0013942,1,1,3,P00450,P00450 [1052-1065],Ceruloplasmin OS=Homo sapiens OX=9606 GN=CP PE=1 SV=1,P00450,0,1556.74386,100.0,6.64,,,100.0,Low,,1097017.59261302,,58.85,,4.0,,,,,,,,1272293.24627931,,,2697701.97896427,872499.598767102,945888.537899441,,,,,,,,157827.328125,,,948391.75,56839.98828125,75761.8828125,,,,,,,,1.0,,,1.0,1.0,1.0,,2,0.4634,0,1,0.84,0.0004186,0.0005351,2.46,48.85,100.0,6.64,,,100.0,Low,,109349.419468126,,138.21
373,[D].DPDAPLQPVTPLQLFEGRRN.[R],,False,0.00861033,0.0013942,1,11,1,F5GXS0,F5GXS0 [1430-1449],C4a anaphylatoxin OS=Homo sapiens OX=9606 GN=C4B PE=1 SV=1,F5GXS0; A0A0G2JL54; A0A140TA32; A0A3B3ISA6; P0C0L4-2; A0A0G2JPR0; P0C0L4; A0A140TA29; P0C0L5; A0A140TA44; A0A140TA49,0,2263.18296,100.0,6.64,,,100.0,Low,,1898428.74272948,,33.48,,4.0,,,,,,,,1288429.95109461,,2674615.45503447,2348907.22054222,1534343.99609427,,,,,,,,,159829.078125,,258188.390625,825771.0625,99956.6015625,,,,,,,,,1.0,,1.0,1.0,1.0,,,3,0.5019,0,1,0.19,0.0004186,0.001149,2.67,100.94,100.0,6.64,,,100.0,Low,,203140.376233213,,99.13
512,[I].EQNTKSPLFMGKVVNPTQK.[-],,False,2.0084e-05,0.0013942,1,2,7,A0A024R6I7,A0A024R6I7 [400-418],Alpha-1-antitrypsin OS=Homo sapiens OX=9606 GN=SERPINA1 PE=1 SV=1,A0A024R6I7; P01009,0,2146.1325,100.0,6.64,,,100.0,Low,,445672.995746281,,129.83,,4.0,,,,,,,,,645731.742323335,291471.380733813,3435558.44015977,,307595.873207063,,,,,,,,,29861.849609375,28136.578125,1207789.1875,,24637.197265625,,,,,,,,,1.0,1.0,2.0,,1.0,,3,0.4211,0,1,6.48,0.0004186,3.477e-07,2.47,62.2,100.0,6.64,,,100.0,Low,,28986.3806725017,,182.92
593,[A].AEVISNARENIQR.[L],,False,0.0079141,0.0013942,1,1,5,P0DJI9,P0DJI9 [73-85],Serum amyloid A-2 proteincur OS=Homo sapiens OX=9606 GN=SAA2 PE=1 SV=1,P0DJI9,0,1499.79248,100.0,6.64,,,100.0,Low,,315564.840642955,,179.92,,4.0,,,,,,,,237644.710322276,,,9737678.7936316,138586.713967069,419033.81108281,,,,,,,,29479.705078125,,,3423333.75,9028.390625,33562.9296875,,,,,,,,1.0,,,1.0,1.0,1.0,,3,0.3538,0,1,0.02,0.0004186,0.001023,2.12,41.27,100.0,6.64,,,100.0,Low,,31455.1310400282,,194.51
653,[S].VSGSTGQWHS.[E],,False,0.0538379,0.00160737,1,2,1,P02671,P02671 [379-388],Fibrinogen alpha chain OS=Homo sapiens OX=9606 GN=FGA PE=1 SV=2,P02671; P02671-2,0,1045.46975,100.0,6.64,,,100.0,Low,,250534.721976138,,35.04,,4.0,,,,,,,,241105.243245961,260332.981857341,188459.546614496,413445.616113022,,,,,,,,,,29908.982421875,12039.0927734375,18192.546875,145349.046875,,,,,,,,,,1.0,1.0,1.0,1.0,,,,2,0.4479,0,1,2.59,0.0009223,0.01352,1.63,35.38,100.0,6.64,,,100.0,Low,,23326.3920204886,,122.81
790,[S].TSYNRGDSTFE.[S],,False,0.0527375,0.00160737,1,2,1,P02671,P02671 [587-597],Fibrinogen alpha chain OS=Homo sapiens OX=9606 GN=FGA PE=1 SV=2,P02671; P02671-2,0,1276.54404,100.0,6.64,,,100.0,Low,,299699.253573354,,61.22,,4.0,,,,,,,,447599.079791543,,195185.961147994,685735.233642066,,200669.855340758,,,,,,,,55524.4375,,18841.8671875,241073.9375,,16072.8515625,,,,,,,,1.0,,1.0,1.0,,1.0,,2,0.418,0,1,-0.32,0.0009223,0.01321,1.89,39.86,100.0,6.64,,,100.0,Low,,32344.7689284627,,129.09
825,[P].GGVWAAEAISDA.[R],,False,0.0639264,0.00160737,1,1,1,P0DJI8,P0DJI8 [68-79],Serum amyloid A-1 protein OS=Homo sapiens OX=9606 GN=SAA1 PE=1 SV=1,P0DJI8,0,1146.54258,100.0,6.64,,,100.0,Low,,464740.438211766,,140.54,,4.0,,,,,,,,175599.80645415,696050.340577925,,4029452.89069974,,310298.928565906,,,,,,,,21783.06640625,32188.83203125,,1416576.0,,24853.701171875,,,,,,,,1.0,1.0,,1.0,,1.0,,2,0.3755,0,1,-1.11,0.0009223,0.0171,2.29,79.34,100.0,6.64,,,100.0,Low,,28284.4765264688,,185.95
919,[L].GEFVSETESRGS.[E],,False,0.0456296,0.00160737,1,2,1,P02671,P02671 [538-549],Fibrinogen alpha chain OS=Homo sapiens OX=9606 GN=FGA PE=1 SV=2,P02671; P02671-2,0,1284.57025,100.0,6.64,,,100.0,Low,,788625.894462281,,43.89,,4.0,,,,,,,,1578264.24966381,,684585.324744928,683975.864873218,908478.138423666,,,,,,,,,195782.875,,66085.0078125,240455.421875,59183.8515625,,,,,,,,,1.0,,1.0,1.0,1.0,,,2,0.4149,0,1,0.75,0.0009223,0.0108,1.88,40.05,100.0,6.64,,,100.0,Low,,113746.704672833,,65.29
922,[L].GEFVSETESRGSESGIFTNTKE.[S],,False,0.0313947,0.00160737,1,2,3,P02671,P02671 [538-559],Fibrinogen alpha chain OS=Homo sapiens OX=9606 GN=FGA PE=1 SV=2,P02671; P02671-2,0,2391.09465,100.0,6.64,,,100.0,Low,,1197627.96170077,,94.75,,4.0,,,,,,,,4603600.6536327,,1501401.14846133,955316.129947984,,633321.018001111,,,,,,,,571074.3125,,144934.609375,335846.5625,,50726.4765625,,,,,,,,1.0,,1.0,1.0,,1.0,,3,0.4672,0,1,1.76,0.0009223,0.006534,2.29,61.97,100.0,6.64,,,100.0,Low,,220625.905881141,,83.41
1203,[R].IHWESASLLR.[S],,False,0.092426,0.00547755,1,2,2,P01024,P01024 [1311-1320],Complement C3 OS=Homo sapiens OX=9606 GN=C3 PE=1 SV=2,P01024; M0QYC8,0,1211.65313,100.0,6.64,,,100.0,Low,,372091.719943458,,127.1,,4.0,,,,,,,,128624.847232771,,732182.276637068,2614898.35565773,,189095.32840155,,,,,,,,15955.8466796875,,70679.6796875,919281.6875,,15145.7783203125,,,,,,,,1.0,,1.0,1.0,,1.0,,3,0.4834,0,1,0.11,0.002328,0.02856,2.11,70.8,100.0,6.64,,,100.0,Low,,33582.0507483264,,173.72
1212,[A].ISDARENIQ.[R],,False,0.092426,0.00547755,1,1,1,P0DJI8,P0DJI8 [76-84],Serum amyloid A-1 protein OS=Homo sapiens OX=9606 GN=SAA1 PE=1 SV=1,P0DJI8,0,1045.52726,100.0,6.64,,,100.0,Low,,183839.093073153,,162.61,,4.0,,,,,,,,119938.679721349,,191733.972622679,2988264.27563516,176269.294792476,,,,,,,,,14878.33203125,,18508.63671875,1050540.5,11483.265625,,,,,,,,,1.0,,1.0,1.0,1.0,,,2,0.2,0,1,1.17,0.002328,0.02837,1.7,34.66,100.0,6.64,,,100.0,Low,,16594.5063966166,,189.08
111,[V].FSNGADLSGVTEEAPLKL.[S],,False,0.0102629,0.0013942,1,4,1,A0A024R6I7,A0A024R6I7 [336-353],Alpha-1-antitrypsin OS=Homo sapiens OX=9606 GN=SERPINA1 PE=1 SV=1,A0A024R6I7; A0A0G2JRN3; P01009; P01009-2,0,1847.93853,100.0,6.64,,,100.0,Low,,171245.214033763,,108.91,,3.0,,,,,,,,149228.684549272,,,973827.52500893,,171245.214033763,,,,,,,,18511.7421875,,,342354.34375,,13716.0556640625,,,,,,,,1.0,,,1.0,,1.0,,2,0.4753,0,1,-1.33,0.0004186,0.00146,1.62,88.23,100.0,6.64,,,100.0,Low,,18511.7421875,,150.86
116,[H].GAEDSLADQAANEWGRSGKDPNH.[F],,False,6.45286e-05,0.0013942,1,2,3,P0DJI8,P0DJI8 [90-112],Serum amyloid A-1 protein OS=Homo sapiens OX=9606 GN=SAA1 PE=1 SV=1,E9PQD6; P0DJI8,0,2425.07632,100.0,6.64,,,100.0,Low,,494247.330179693,,136.63,,3.0,,,,,,,,,,494247.330179693,6005390.46591259,,489664.489108149,,,,,,,,,,47711.12890625,2111227.5625,,39220.1640625,,,,,,,,,,2.0,2.0,,1.0,,3,0.5513,0,1,1.56,0.0004186,1.662e-06,3.12,59.32,100.0,6.64,,,100.0,Low,,47711.12890625,,162.93
151,[L].GIEEAFTSKADL.[S],,False,0.0155208,0.0013942,1,2,1,G3V3A0,G3V3A0 [114-125],Alpha-1-antichymotrypsin OS=Homo sapiens OX=9606 GN=SERPINA3 PE=1 SV=1,G3V3A0; P01011,0,1280.63687,100.0,6.64,,,100.0,Low,,565595.899703028,,51.88,,3.0,,,,,,,,565595.899703028,,,1066651.43902341,,392428.845452687,,,,,,,,70161.8828125,,,374987.09375,,31431.978515625,,,,,,,,1.0,,,1.0,,1.0,,2,0.4917,0,1,2.59,0.0004186,0.002538,2.4,74.39,100.0,6.64,,,100.0,Low,,70161.8828125,,118.45
366,[F].TSSTSYNRGDSTFESKSY.[K],,False,0.00107449,0.0013942,1,2,1,P02671,P02671 [584-601],Fibrinogen alpha chain OS=Homo sapiens OX=9606 GN=FGA PE=1 SV=2,P02671; P02671-2,0,2016.87812,100.0,6.64,,,100.0,Low,,3131746.67536284,,41.92,,3.0,,,,,,,,5259545.51165999,,3131746.67536284,2359113.29276979,,,,,,,,,,652443.9375,,302316.59375,829359.0625,,,,,,,,,,1.0,,1.0,1.0,,,,3,0.3544,0,1,0.1,0.0004186,7.106e-05,2.37,43.7,100.0,6.64,,,100.0,Low,,652443.9375,,45.1
487,[D].DEEFIESNKM.[H],1xOxidation [M10],False,0.00352586,0.0013942,1,4,1,P00450,P00450 [949-958],Ceruloplasmin OS=Homo sapiens OX=9606 GN=CP PE=1 SV=1,E9PFZ2; H7C5R1; P00450; H7C5N5,0,1257.53036,100.0,6.64,,,100.0,Low,,1012204.86158532,,75.58,,3.0,,,,,,,,674321.470280849,,,2762332.96958844,,1012204.86158532,,,,,,,,83649.234375,,,971113.125,,81073.5546875,,,,,,,,1.0,,,1.0,,1.0,,2,0.546,0,1,-0.13,0.0004186,0.0003471,1.74,44.81,100.0,6.64,,,100.0,Low,,83649.234375,,135.53
501,[D].ESGPSIVHR.[K],,False,0.0151982,0.0013942,1,8,2,P60709,P60709 [364-372],"Actin, cytoplasmic 1 OS=Homo sapiens OX=9606 GN=ACTB PE=1 SV=1",A5A3E0; A0A2R8YFE2; Q9BYX7; P0CG39; P60709; Q6S8J3; P0CG38; P63261,0,981.51122,100.0,6.64,,,100.0,Low,,1221810.96673433,,53.05,,3.0,,,,,,,,,481922.397894501,1657731.2674656,,,1221810.96673433,,,,,,,,,22286.490234375,160025.609375,,,97862.1640625,,,,,,,,,1.0,1.0,,,1.0,,2,0.4779,0,1,-0.06,0.0004186,0.002464,1.13,34.86,100.0,6.64,,,100.0,Low,,97862.1640625,,73.86
801,[T].GNRNPGSSGTGGTATWKPGSSGP.[G],,False,0.0694051,0.00160737,1,2,1,P02671,P02671 [306-328],Fibrinogen alpha chain OS=Homo sapiens OX=9606 GN=FGA PE=1 SV=2,P02671; P02671-2,0,2129.99588,100.0,6.64,,,100.0,Low,,406977.663619519,,61.44,,3.0,,,,,,,,820896.979872042,,,406977.663619519,237501.315035382,,,,,,,,,101831.8515625,,,143075.203125,15472.2958984375,,,,,,,,,1.0,,,1.0,1.0,,,3,0.4492,0,1,1.58,0.0009223,0.01929,1.87,44.28,100.0,6.64,,,100.0,Low,,101831.8515625,,75.03
830,[S].DMREANYIGSDK.[Y],1xOxidation [M2],False,0.0307473,0.00160737,2,8,1,P0DJI9; P0DJI8,P0DJI9 [41-52]; P0DJI8 [41-52],"Serum amyloid A-2 proteincur OS=Homo sapiens OX=9606 GN=SAA2 PE=1 SV=1
Serum amyloid A-1 protein OS=Homo sapiens OX=9606 GN=SAA1 PE=1 SV=1",E9PR14; P0DJI9; E9PQD6; P0DJI8; A0A096LPE2; P0DJI9-2; A0A3B3ISW8; G3V1D9,0,1414.62672,100.0,6.64,,,100.0,Low,,1074219.90118588,,77.32,,3.0,,,,,,,,362484.643951803,,,2239017.18502055,,1074219.90118588,,,,,,,,44966.03515625,,,787138.625,,86040.7109375,,,,,,,,1.0,,,1.0,,1.0,Shared,3,0.5207,0,1,0.1,0.0009223,0.00636,2.42,36.2,100.0,6.64,,,100.0,Low,,86040.7109375,,136.3
871,[A].EAISDARENIQ.[R],,False,0.0389224,0.00160737,1,1,1,P0DJI8,P0DJI8 [74-84],Serum amyloid A-1 protein OS=Homo sapiens OX=9606 GN=SAA1 PE=1 SV=1,P0DJI8,0,1245.60697,100.0,6.64,,,100.0,Low,,2130395.43866714,,91.81,,3.0,,,,,,,,854018.274388231,,,6273637.46868584,,2130395.43866714,,,,,,,,105940.53125,,,2205531.25,,170636.140625,,,,,,,,1.0,,,1.0,,1.0,,2,0.2,0,1,2.07,0.0009223,0.0087,1.35,41.84,100.0,6.64,,,100.0,Low,,170636.140625,,144.31
929,[A].EEAGARVQQNVPSGTDTGDPQSKP.[L],,False,0.0212581,0.00160737,1,6,2,B1AH95,B1AH95 [28-51],Apolipoprotein L1 OS=Homo sapiens OX=9606 GN=APOL1 PE=1 SV=1,B1AH95; F8WCH3; B1AH96; O14791-2; O14791; B1AH94,0,2468.1648,100.0,6.64,,,100.0,Low,,2098130.7918667,,84.63,,3.0,,,,,,,,4579938.72641447,,,2098130.7918667,,541666.446021382,,,,,,,,568139.0625,,,737609.25,,43385.3125,,,,,,,,1.0,,,1.0,,1.0,,3,0.2116,0,1,2.76,0.0009223,0.003852,1.89,41.39,100.0,6.64,,,100.0,Low,,568139.0625,,80.48
1041,[M].IIVPTDTQNIFFMSKVTNPKQA.[-],1xOxidation [M13],False,0.0584688,0.00160737,1,2,2,G3V3A0,G3V3A0 [184-205],Alpha-1-antichymotrypsin OS=Homo sapiens OX=9606 GN=SERPINA3 PE=1 SV=1,G3V3A0; P01011,0,2508.31667,100.0,6.64,,,100.0,Low,,2190545.58672795,,49.6,,3.0,,,,,,,,2190545.58672795,,904430.705347316,,,2826142.81911765,,,,,,,,271736.0625,,87307.3203125,,,226362.71875,,,,,,,,1.0,,1.0,,,1.0,,3,0.1765,0,1,-0.19,0.0009223,0.01519,1.19,85.16,100.0,6.64,,,100.0,Low,,226362.71875,,49.25
1061,[DR].SLMPFSPYEPLNF.[H],,False,0.0728105,0.00233135,1,9,1,E7ETB4,E7ETB4 [194-206],Clusterin (Fragment) OS=Homo sapiens OX=9606 GN=CLU PE=1 SV=1,E7ETB4; P10909-5; P10909-4; P10909-2; P10909-6; H0YLK8; H0YC35; P10909; P10909-3,0,1541.73448,100.0,6.64,,,100.0,Low,,805645.085742447,,129.02,,3.0,,,,,,,,241932.030201185,,805645.085742447,5008659.45738149,,,,,,,,,,30011.544921875,,77771.2578125,1760821.375,,,,,,,,,,1.0,,1.0,1.0,,,,2,0.3113,0,1,0.36,0.001323,0.02043,1.51,120.93,100.0,6.64,,,100.0,Low,,77771.2578125,,158.27
1264,[DR].SLMPFSPYEPLNFHA.[M],1xOxidation [M3],False,0.107972,0.0080153,1,9,1,E7ETB4,E7ETB4 [194-208],Clusterin (Fragment) OS=Homo sapiens OX=9606 GN=CLU PE=1 SV=1,E7ETB4; P10909-5; P10909-4; P10909-2; P10909-6; H0YLK8; H0YC35; P10909; P10909-3,0,1765.82542,100.0,6.64,,,100.0,Low,,135826.044531982,,122.66,,3.0,,,,,,,,134425.132762994,,,1118966.44825759,,135826.044531982,,,,,,,,16675.369140625,,,393378.71875,,10879.1220703125,,,,,,,,1.0,,,1.0,,1.0,,2,0.0962,0,1,-1.14,0.003036,0.03512,1.04,97.25,100.0,6.64,,,100.0,Low,,16675.369140625,,156.21
138,[P].GGVWAAEAISDARENIQ.[R],,False,5.72586e-05,0.0013942,1,1,8,P0DJI8,P0DJI8 [68-84],Serum amyloid A-1 protein OS=Homo sapiens OX=9606 GN=SAA1 PE=1 SV=1,P0DJI8,0,1786.87185,100.0,6.64,,,100.0,Low,,1490297.75521609,,115.75,,2.0,,,,,,,,,470883.234468502,,4716641.48694737,,,,,,,,,,,21775.984375,,1658160.875,,,,,,,,,,,1.0,,1.0,,,,2,0.5141,0,1,0.63,0.0004186,1.411e-06,3.54,82.44,100.0,6.64,,,100.0,Low,,190021.275927819,,137.76
149,[F].SPSVVHLGVPLSVGVQL.[Q],,False,0.0172384,0.0013942,1,10,3,F5GXS0,F5GXS0 [27-43],C4a anaphylatoxin OS=Homo sapiens OX=9606 GN=C4B PE=1 SV=1,F5GXS0; A0A0G2JL54; A0A140TA32; P0C0L4-2; A0A0G2JPR0; P0C0L4; A0A140TA29; P0C0L5; A0A140TA44; A0A140TA49,0,1687.97413,100.0,6.64,,,100.0,Low,,718328.330787946,,132.86,,2.0,,,,,,,,126904.373989358,,,4066018.9605117,,,,,,,,,,15742.4228515625,,,1429431.0,,,,,,,,,,1.0,,,1.0,,,,2,0.4062,0,1,0.75,0.0004186,0.002907,2.56,104.65,100.0,6.64,,,100.0,Low,,150009.023859006,,138.34
400,[E].EELQFSLGSK.[I],,False,0.0140713,0.0013942,1,12,5,F5GXS0,F5GXS0 [1356-1365],C4a anaphylatoxin OS=Homo sapiens OX=9606 GN=C4B PE=1 SV=1,F5GXS0; A0A0G2JL54; A0A140TA32; A0A3B3ISA6; P0C0L4-2; A0A0G2JPR0; P0C0L4; A0A140TA29; A0A3B3ISD7; P0C0L5; A0A140TA44; A0A140TA49,0,1137.57863,100.0,6.64,,,100.0,Low,,6934967.2842669,,42.16,,2.0,,,,,,,,5099399.7502709,,,9431261.24428612,,,,,,,,,,632577.9375,,,3315611.0,,,,,,,,,,1.0,,,1.0,,,,2,0.4051,0,1,1.96,0.0004186,0.002226,1.58,67.52,100.0,6.64,,,100.0,Low,,1448234.22412685,,96.1
468,[A].DLSGVTEEAPLKLSKA.[V],,False,0.011976,0.0013942,1,2,2,A0A024R6I7,A0A024R6I7 [341-356],Alpha-1-antitrypsin OS=Homo sapiens OX=9606 GN=SERPINA1 PE=1 SV=1,A0A024R6I7; P01009,0,1657.90069,100.0,6.64,,,100.0,Low,,809409.693969138,,58.32,,2.0,,,,,,,,,,,1254899.67498285,,522068.86793573,,,,,,,,,,,441166.78125,,41815.625,,,,,,,,,,,1.0,,1.0,,2,0.5876,0,1,3.01,0.0004186,0.001784,1.94,71.0,100.0,6.64,,,100.0,Low,,135822.180394835,,116.93
492,[A].DEAGSEADHEGTHSTKRGHAKSRPV.[R],,False,4.93986e-05,0.0013942,1,2,61,P02671,P02671 [605-629],Fibrinogen alpha chain OS=Homo sapiens OX=9606 GN=FGA PE=1 SV=2,P02671; P02671-2,0,2659.25674,100.0,6.64,,,100.0,Low,,6646086.37223328,,140.56,,2.0,,,,,,,,,,366270.198058351,120595299.047912,,,,,,,,,,,,35357.125,42395930.90625,,,,,,,,,,,,1.0,15.0,,,,4,0.5674,0,1,-1.2,0.0004186,1.157e-06,3.19,74.6,100.0,6.64,,,100.0,Low,,1224335.83160163,,141.19
549,[E].ADHEGTHSTKRGHAKSRPV.[R],,False,7.07049e-05,0.0013942,1,2,52,P02671,P02671 [611-629],Fibrinogen alpha chain OS=Homo sapiens OX=9606 GN=FGA PE=1 SV=2,P02671; P02671-2,0,2071.05401,100.0,6.64,,,100.0,Low,,3366863.493411,,140.03,,2.0,,,,,,,,,,236837.12815765,47863144.9023402,,,,,,,,,,,,22862.5751953125,16826547.96875,,,,,,,,,,,,2.0,15.0,,,,4,0.5964,0,1,0.28,0.0004186,1.87e-06,3.37,83.16,100.0,6.64,,,100.0,Low,,620240.451932216,,141.04
629,[L].QLGIEEAFTSKA.[D],,False,0.0212581,0.00160737,1,2,2,G3V3A0,G3V3A0 [112-123],Alpha-1-antichymotrypsin OS=Homo sapiens OX=9606 GN=SERPINA3 PE=1 SV=1,G3V3A0; P01011,0,1293.66851,100.0,6.64,,,100.0,Low,,298835.716463162,,96.12,,2.0,,,,,,,,,,,684276.404259727,,130506.890020067,,,,,,,,,,,240561.078125,,10453.0791015625,,,,,,,,,,,1.0,,1.0,,2,0.4029,0,1,1.41,0.0009223,0.003868,2.06,74.18,100.0,6.64,,,100.0,Low,,50145.8271284639,,129.64
696,[A].STGKTFPGFFSPML.[G],,False,0.0516593,0.00160737,1,2,2,P02671,P02671 [524-537],Fibrinogen alpha chain OS=Homo sapiens OX=9606 GN=FGA PE=1 SV=2,P02671; P02671-2,0,1516.75046,100.0,6.64,,,100.0,Low,,415778.462485278,,50.49,,2.0,,,,,,,,,,286200.570139481,604023.010095236,,,,,,,,,,,,27627.771484375,212347.5625,,,,,,,,,,,,1.0,1.0,,,,2,0.5062,0,1,1.26,0.0009223,0.01279,1.6,107.6,100.0,6.64,,,100.0,Low,,76594.3204944991,,108.86
697,[S].STSYNRGDSTFE.[S],,False,0.0520163,0.00160737,1,2,1,P02671,P02671 [586-597],Fibrinogen alpha chain OS=Homo sapiens OX=9606 GN=FGA PE=1 SV=2,P02671; P02671-2,0,1363.57606,100.0,6.64,,,100.0,Low,,416196.026541037,,9.12,,2.0,,,,,,,,443950.019540735,,,390177.103016556,,,,,,,,,,55071.7734375,,,137168.875,,,,,,,,,,1.0,,,1.0,,,,2,0.3561,0,1,0.47,0.0009223,0.01301,1.32,40.22,100.0,6.64,,,100.0,Low,,86914.5166625044,,60.39
705,[L].SSTRGYSIFSY.[A],,False,0.0670687,0.00160737,1,1,1,P02741,P02741 [62-72],C-reactive protein OS=Homo sapiens OX=9606 GN=CRP PE=1 SV=1,P02741,0,1267.59534,100.0,6.64,,,100.0,Low,,1066319.02809978,,125.43,,2.0,,,,,,,,,,,4355488.61295338,,261058.257919922,,,,,,,,,,,1531195.625,,20909.720703125,,,,,,,,,,,1.0,,1.0,,2,0.4062,0,1,-0.64,0.0009223,0.01831,2.24,77.04,100.0,6.64,,,100.0,Low,,178932.593063972,,137.61
781,[DR].SLMPFSPYEPLNFH.[A],1xOxidation [M3],False,0.0203862,0.00160737,1,9,2,E7ETB4,E7ETB4 [194-207],Clusterin (Fragment) OS=Homo sapiens OX=9606 GN=CLU PE=1 SV=1,E7ETB4; P10909-5; P10909-4; P10909-2; P10909-6; H0YLK8; H0YC35; P10909; P10909-3,0,1694.78831,100.0,6.64,,,100.0,Low,,499554.850172684,,71.3,,2.0,,,,,,,,286821.640069045,,,870070.501901384,,,,,,,,,,35580.078125,,,305878.0,,,,,,,,,,1.0,,,1.0,,,,2,0.5198,0,1,-0.61,0.0009223,0.003654,2.27,94.77,100.0,6.64,,,100.0,Low,,104322.399975838,,111.95